Target
Serine/threonine-protein kinase ULK2
Ligand
BDBM60665
Substrate
Meas. Tech.
ChEMBL_774565 (CHEMBL1908782)
Kd
19±n/a nM
Citation
 Davis, MIHunt, JPHerrgard, SCiceri, PWodicka, LMPallares, GHocker, MTreiber, DKZarrinkar, PP Comprehensive analysis of kinase inhibitor selectivity. Nat Biotechnol 29:1046-51 (2011)  
Target
Name:
Serine/threonine-protein kinase ULK2
Synonyms:
KIAA0623 ULK2_HUMAN | Unc-51-like kinase 2
Type:
PROTEIN
Mol. Mass.:
112726.26
Organism:
Homo sapiens (Human)
Description:
ChEMBL_1510276
Residue:
1036
  
Inhibitor
Name:
BDBM60665
Synonyms:
BDBM50249542 US9212178, R406
Type:
Emp. Form.:
C22H23FN6O5
Mol. Mass.:
470.4536
SMILES:
COc1cc(Nc2ncc(F)c(Nc3ccc4OC(C)(C)C(=O)Nc4n3)n2)cc(OC)c1OC
: