Target
Serine/threonine-protein kinase 36
Ligand
BDBM60665
Substrate
Meas. Tech.
ChEMBL_774576 (CHEMBL1908793)
Kd
230±n/a nM
Citation
 Davis, MIHunt, JPHerrgard, SCiceri, PWodicka, LMPallares, GHocker, MTreiber, DKZarrinkar, PP Comprehensive analysis of kinase inhibitor selectivity. Nat Biotechnol 29:1046-51 (2011)  
Target
Name:
Serine/threonine-protein kinase 36
Synonyms:
KIAA1278 STK36_HUMAN | Serine/threonine-protein kinase 36
Type:
PROTEIN
Mol. Mass.:
143977.45
Organism:
Homo sapiens (Human)
Description:
ChEMBL_774576
Residue:
1315
  
Inhibitor
Name:
BDBM60665
Synonyms:
BDBM50249542 US9212178, R406
Type:
Emp. Form.:
C22H23FN6O5
Mol. Mass.:
470.4536
SMILES:
COc1cc(Nc2ncc(F)c(Nc3ccc4OC(C)(C)C(=O)Nc4n3)n2)cc(OC)c1OC
: