Target
Interleukin-1 receptor-associated kinase 4
Ligand
BDBM60665
Substrate
Meas. Tech.
ChEMBL_774578 (CHEMBL1908795)
Kd
140±n/a nM
Citation
 Davis, MIHunt, JPHerrgard, SCiceri, PWodicka, LMPallares, GHocker, MTreiber, DKZarrinkar, PP Comprehensive analysis of kinase inhibitor selectivity. Nat Biotechnol 29:1046-51 (2011)  
Target
Name:
Interleukin-1 receptor-associated kinase 4
Synonyms:
IRAK-4 IRAK4_HUMAN Interleukin-1 receptor-associated kinase 4 (IRAK4) | Renal carcinoma antigen NY-REN-64
Type:
Protein
Mol. Mass.:
51519.08
Organism:
Homo sapiens (Human)
Description:
Q9NWZ3
Residue:
460
  
Inhibitor
Name:
BDBM60665
Synonyms:
BDBM50249542 US9212178, R406
Type:
Emp. Form.:
C22H23FN6O5
Mol. Mass.:
470.4536
SMILES:
COc1cc(Nc2ncc(F)c(Nc3ccc4OC(C)(C)C(=O)Nc4n3)n2)cc(OC)c1OC
: