Target
Serine/threonine-protein kinase PAK 5
Ligand
BDBM50332294
Substrate
Meas. Tech.
ChEMBL_774597 (CHEMBL1908814)
Kd
1200±n/a nM
Citation
 Davis, MIHunt, JPHerrgard, SCiceri, PWodicka, LMPallares, GHocker, MTreiber, DKZarrinkar, PP Comprehensive analysis of kinase inhibitor selectivity. Nat Biotechnol 29:1046-51 (2011)  
Target
Name:
Serine/threonine-protein kinase PAK 5
Synonyms:
KIAA1264 PAK5_HUMAN PAK7/PAK5 Serine/threonine-protein kinase (PAK7) Serine/threonine-protein kinase PAK7
Type:
Protein
Mol. Mass.:
80760.58
Organism:
Homo sapiens (Human)
Description:
Q9P286
Residue:
719
  
Inhibitor
Name:
BDBM50332294
Synonyms:
CHEMBL1287853 US10112907, Example 00018 US10766894, Compound TABLE 1.3 US11384069, Example T-5
Type:
Small organic molecule
Emp. Form.:
C27H36N6O3S
Mol. Mass.:
524.678
SMILES:
Cc1cnc(Nc2ccc(OCCN3CCCC3)cc2)nc1Nc1cccc(c1)S(=O)(=O)NC(C)(C)C
: