Target
Serine/threonine-protein kinase SBK1
Ligand
BDBM25919
Substrate
Meas. Tech.
ChEMBL_774292 (CHEMBL1908509)
Kd
>10000±n/a nM
Citation
 Davis, MIHunt, JPHerrgard, SCiceri, PWodicka, LMPallares, GHocker, MTreiber, DKZarrinkar, PP Comprehensive analysis of kinase inhibitor selectivity. Nat Biotechnol 29:1046-51 (2011)  
Target
Name:
Serine/threonine-protein kinase SBK1
Synonyms:
SBK1 SH3-binding kinase 1
Type:
PROTEIN
Mol. Mass.:
46265.73
Organism:
Homo sapiens (Human)
Description:
ChEMBL_774292
Residue:
424
  
Inhibitor
Name:
BDBM25919
Synonyms:
BMS-345541 CHEMBL471496 | N-(2-aminoethyl)-3,12-dimethyl-2,5,8-triazatricyclo[7.4.0.0^{2,6}]trideca-1(13),3,5,7,9,11-hexaen-7-amine
Type:
Small organic molecule
Emp. Form.:
C14H17N5
Mol. Mass.:
255.3183
SMILES:
Cc1cnc2c(NCCN)nc3ccc(C)cc3n12
: