Target
Serine/threonine-protein kinase DCLK2
Ligand
BDBM32362
Substrate
Meas. Tech.
ChEMBL_774294 (CHEMBL1908511)
Kd
>10000±n/a nM
Citation
 Davis, MIHunt, JPHerrgard, SCiceri, PWodicka, LMPallares, GHocker, MTreiber, DKZarrinkar, PP Comprehensive analysis of kinase inhibitor selectivity. Nat Biotechnol 29:1046-51 (2011)  
Target
Name:
Serine/threonine-protein kinase DCLK2
Synonyms:
DCAMKL2 DCK2 DCLK2_HUMAN | Serine/threonine-protein kinase DCLK2
Type:
PROTEIN
Mol. Mass.:
83621.38
Organism:
Homo sapiens (Human)
Description:
ChEMBL_586817
Residue:
766
  
Inhibitor
Name:
BDBM32362
Synonyms:
5-[[3-methoxy-4-[(4-methoxyphenyl)methoxy]phenyl]methyl]pyrimidine-2,4-diamine [2-amino-5-(3-methoxy-4-p-anisyloxy-benzyl)pyrimidin-4-yl]amine | cid_11617559
Type:
Small organic molecule
Emp. Form.:
C20H22N4O3
Mol. Mass.:
366.4137
SMILES:
COc1ccc(COc2ccc(Cc3cnc(N)nc3N)cc2OC)cc1
: