Target
Protein-tyrosine kinase 6
Ligand
BDBM50332294
Substrate
Meas. Tech.
ChEMBL_774509 (CHEMBL1908726)
Kd
1200±n/a nM
Citation
 Davis, MIHunt, JPHerrgard, SCiceri, PWodicka, LMPallares, GHocker, MTreiber, DKZarrinkar, PP Comprehensive analysis of kinase inhibitor selectivity. Nat Biotechnol 29:1046-51 (2011)  
Target
Name:
Protein-tyrosine kinase 6
Synonyms:
BRK KH domain-containing, RNA-binding, signal transduction-associated protein 1 PTK6_HUMAN Tyrosine Kinase BRK Tyrosine-protein kinase BRK
Type:
Tyrosine-protein kinase
Mol. Mass.:
51839.11
Organism:
Homo sapiens (Human)
Description:
Residue:
451
  
Inhibitor
Name:
BDBM50332294
Synonyms:
CHEMBL1287853 US10112907, Example 00018 US10766894, Compound TABLE 1.3 US11384069, Example T-5
Type:
Small organic molecule
Emp. Form.:
C27H36N6O3S
Mol. Mass.:
524.678
SMILES:
Cc1cnc(Nc2ccc(OCCN3CCCC3)cc2)nc1Nc1cccc(c1)S(=O)(=O)NC(C)(C)C
: