Target
Serine/threonine-protein kinase 10
Ligand
BDBM50332294
Substrate
Meas. Tech.
ChEMBL_774510 (CHEMBL1908727)
Kd
2900±n/a nM
Citation
 Davis, MIHunt, JPHerrgard, SCiceri, PWodicka, LMPallares, GHocker, MTreiber, DKZarrinkar, PP Comprehensive analysis of kinase inhibitor selectivity. Nat Biotechnol 29:1046-51 (2011)  
Target
Name:
Serine/threonine-protein kinase 10
Synonyms:
LOK STK10_HUMAN Serine/threonine-protein kinase 10 (STK10)
Type:
Protein
Mol. Mass.:
112139.54
Organism:
Homo sapiens (Human)
Description:
O94804
Residue:
968
  
Inhibitor
Name:
BDBM50332294
Synonyms:
CHEMBL1287853 US10112907, Example 00018 US10766894, Compound TABLE 1.3 US11384069, Example T-5
Type:
Small organic molecule
Emp. Form.:
C27H36N6O3S
Mol. Mass.:
524.678
SMILES:
Cc1cnc(Nc2ccc(OCCN3CCCC3)cc2)nc1Nc1cccc(c1)S(=O)(=O)NC(C)(C)C
: