Target
Serine/threonine-protein kinase Nek5
Ligand
BDBM21
Substrate
Meas. Tech.
ChEMBL_774222 (CHEMBL1908439)
Kd
>10000±n/a nM
Citation
 Davis, MIHunt, JPHerrgard, SCiceri, PWodicka, LMPallares, GHocker, MTreiber, DKZarrinkar, PP Comprehensive analysis of kinase inhibitor selectivity. Nat Biotechnol 29:1046-51 (2011)  
Target
Name:
Serine/threonine-protein kinase Nek5
Synonyms:
NEK5 | NEK5_HUMAN
Type:
PROTEIN
Mol. Mass.:
81473.82
Organism:
Homo sapiens (Human)
Description:
ChEMBL_655494
Residue:
708
  
Inhibitor
Name:
BDBM21
Synonyms:
CHEMBL24828 VANDETANIB ZD6474 | cid_3081361
Type:
Emp. Form.:
C22H24BrFN4O2
Mol. Mass.:
475.354
SMILES:
COc1cc2c(Nc3ccc(Br)cc3F)ncnc2cc1OCC1CCN(C)CC1
: