Target
Serine/threonine-protein kinase PAK 5
Ligand
BDBM60589
Substrate
Meas. Tech.
ChEMBL_774597 (CHEMBL1908814)
Kd
>10000±n/a nM
Citation
 Davis, MIHunt, JPHerrgard, SCiceri, PWodicka, LMPallares, GHocker, MTreiber, DKZarrinkar, PP Comprehensive analysis of kinase inhibitor selectivity. Nat Biotechnol 29:1046-51 (2011)  
Target
Name:
Serine/threonine-protein kinase PAK 5
Synonyms:
KIAA1264 PAK5_HUMAN PAK7/PAK5 Serine/threonine-protein kinase (PAK7) Serine/threonine-protein kinase PAK7
Type:
Protein
Mol. Mass.:
80760.58
Organism:
Homo sapiens (Human)
Description:
Q9P286
Residue:
719
  
Inhibitor
Name:
BDBM60589
Synonyms:
6-{[6-(1-methyl-1H-pyrazol-4-yl)-[1,2,4]triazolo[4,3-b]pyridazin-3-yl]sulfanyl}quinoline (4) | BDBM50355498
Type:
Emp. Form.:
C18H13N7S
Mol. Mass.:
359.408
SMILES:
Cn1cc(cn1)-c1ccc2nnc(Sc3ccc4ncccc4c3)n2n1
: