Target
Serine/threonine-protein kinase VRK2
Ligand
BDBM50355495
Substrate
Meas. Tech.
ChEMBL_774538 (CHEMBL1908755)
Kd
>10000±n/a nM
Citation
 Davis, MIHunt, JPHerrgard, SCiceri, PWodicka, LMPallares, GHocker, MTreiber, DKZarrinkar, PP Comprehensive analysis of kinase inhibitor selectivity. Nat Biotechnol 29:1046-51 (2011)  
Target
Name:
Serine/threonine-protein kinase VRK2
Synonyms:
VRK2 Vaccinia-related kinase 2
Type:
PROTEIN
Mol. Mass.:
58156.94
Organism:
Homo sapiens (Human)
Description:
ChEMBL_774538
Residue:
508
  
Inhibitor
Name:
BDBM50355495
Synonyms:
CHEMBL1908391
Type:
Small organic molecule
Emp. Form.:
C28H30N6OS
Mol. Mass.:
498.642
SMILES:
CN1CCN(Cc2ccc(cc2)C(=O)Nc2ccc(C)c(Nc3nc(cs3)-c3cccnc3)c2)CC1
: