Target
Phosphatidylinositol 4-phosphate 5-kinase type-1 gamma
Ligand
BDBM50355495
Substrate
Meas. Tech.
ChEMBL_774231 (CHEMBL1908448)
Kd
>10000±n/a nM
Citation
 Davis, MIHunt, JPHerrgard, SCiceri, PWodicka, LMPallares, GHocker, MTreiber, DKZarrinkar, PP Comprehensive analysis of kinase inhibitor selectivity. Nat Biotechnol 29:1046-51 (2011)  
Target
Name:
Phosphatidylinositol 4-phosphate 5-kinase type-1 gamma
Synonyms:
KIAA0589 PIP5K1-gamma PIP5KIgamma Phosphatidylinositol 4-phosphate 5-kinase type-1 gamma PtdIns(4)P-5-kinase 1 gamma
Type:
PROTEIN
Mol. Mass.:
73241.99
Organism:
Homo sapiens (Human)
Description:
ChEMBL_1508846
Residue:
668
  
Inhibitor
Name:
BDBM50355495
Synonyms:
CHEMBL1908391
Type:
Small organic molecule
Emp. Form.:
C28H30N6OS
Mol. Mass.:
498.642
SMILES:
CN1CCN(Cc2ccc(cc2)C(=O)Nc2ccc(C)c(Nc3nc(cs3)-c3cccnc3)c2)CC1
: