Target
Activin receptor type-2B
Ligand
BDBM36409
Substrate
Meas. Tech.
ChEMBL_774300 (CHEMBL1908517)
Kd
7.6±n/a nM
Citation
 Davis, MIHunt, JPHerrgard, SCiceri, PWodicka, LMPallares, GHocker, MTreiber, DKZarrinkar, PP Comprehensive analysis of kinase inhibitor selectivity. Nat Biotechnol 29:1046-51 (2011)  
Target
Name:
Activin receptor type-2B
Synonyms:
ACVR2B Activin receptor type-2B
Type:
Enzyme Catalytic Domain
Mol. Mass.:
57713.76
Organism:
Homo sapiens (Human)
Description:
gi_116734708
Residue:
512
  
Inhibitor
Name:
BDBM36409
Synonyms:
2-(4-amino-1-isopropyl-1H-pyrazolo[3,4-d]pyrimidin-3-yl)-1H-indol-5-ol, PP242 US10172858, Table 2.1 | US9828378, # 1
Type:
Small organic molecule
Emp. Form.:
C16H16N6O
Mol. Mass.:
308.3378
SMILES:
CC(C)n1nc(-c2cc3cc(O)ccc3[nH]2)c2c(N)ncnc12
: