Target
Rhodopsin kinase GRK7
Ligand
BDBM50332294
Substrate
Meas. Tech.
ChEMBL_774199 (CHEMBL1908416)
Kd
2600±n/a nM
Citation
 Davis, MIHunt, JPHerrgard, SCiceri, PWodicka, LMPallares, GHocker, MTreiber, DKZarrinkar, PP Comprehensive analysis of kinase inhibitor selectivity. Nat Biotechnol 29:1046-51 (2011)  
Target
Name:
Rhodopsin kinase GRK7
Synonyms:
G protein-coupled receptor kinase 7 GRK7 | GRK7_HUMAN
Type:
PROTEIN
Mol. Mass.:
62210.84
Organism:
Homo sapiens (Human)
Description:
ChEMBL_774199
Residue:
553
  
Inhibitor
Name:
BDBM50332294
Synonyms:
CHEMBL1287853 US10112907, Example 00018 US10766894, Compound TABLE 1.3 US11384069, Example T-5
Type:
Small organic molecule
Emp. Form.:
C27H36N6O3S
Mol. Mass.:
524.678
SMILES:
Cc1cnc(Nc2ccc(OCCN3CCCC3)cc2)nc1Nc1cccc(c1)S(=O)(=O)NC(C)(C)C
: