Target
Homeodomain-interacting protein kinase 1
Ligand
BDBM50332294
Substrate
Meas. Tech.
ChEMBL_774206 (CHEMBL1908423)
Kd
860±n/a nM
Citation
 Davis, MIHunt, JPHerrgard, SCiceri, PWodicka, LMPallares, GHocker, MTreiber, DKZarrinkar, PP Comprehensive analysis of kinase inhibitor selectivity. Nat Biotechnol 29:1046-51 (2011)  
Target
Name:
Homeodomain-interacting protein kinase 1
Synonyms:
HIPK1 Homeodomain-interacting protein kinase 1 (HIPK1) MYAK | NBAK2
Type:
PROTEIN
Mol. Mass.:
130868.34
Organism:
Homo sapiens (Human)
Description:
ChEMBL_1459267
Residue:
1210
  
Inhibitor
Name:
BDBM50332294
Synonyms:
CHEMBL1287853 US10112907, Example 00018 US10766894, Compound TABLE 1.3 US11384069, Example T-5
Type:
Small organic molecule
Emp. Form.:
C27H36N6O3S
Mol. Mass.:
524.678
SMILES:
Cc1cnc(Nc2ccc(OCCN3CCCC3)cc2)nc1Nc1cccc(c1)S(=O)(=O)NC(C)(C)C
: