Target
Bone morphogenetic protein receptor type-1A
Ligand
BDBM50355496
Substrate
Meas. Tech.
ChEMBL_774425 (CHEMBL1908642)
Kd
1900±n/a nM
Citation
 Davis, MIHunt, JPHerrgard, SCiceri, PWodicka, LMPallares, GHocker, MTreiber, DKZarrinkar, PP Comprehensive analysis of kinase inhibitor selectivity. Nat Biotechnol 29:1046-51 (2011)  
Target
Name:
Bone morphogenetic protein receptor type-1A
Synonyms:
ACVRLK3 Activin receptor-like kinase 3 (ALK-3) BMR1A_HUMAN
Type:
Enzyme
Mol. Mass.:
60204.46
Organism:
Homo sapiens (Human)
Description:
P36894
Residue:
532
  
Inhibitor
Name:
BDBM50355496
Synonyms:
CHEMBL1908397
Type:
Small organic molecule
Emp. Form.:
C20H20N4O
Mol. Mass.:
332.399
SMILES:
O=C(N1CCNCC1)c1ccc(\C=C\c2n[nH]c3ccccc23)cc1
: