Target
Dual specificity mitogen-activated protein kinase kinase 5
Ligand
BDBM482158
Substrate
Meas. Tech.
ChEMBL_774201 (CHEMBL1908418)
Kd
200±n/a nM
Citation
 Davis, MIHunt, JPHerrgard, SCiceri, PWodicka, LMPallares, GHocker, MTreiber, DKZarrinkar, PP Comprehensive analysis of kinase inhibitor selectivity. Nat Biotechnol 29:1046-51 (2011)  
Target
Name:
Dual specificity mitogen-activated protein kinase kinase 5
Synonyms:
MAP kinase kinase 5 MAPK/ERK kinase 5 MEK5 MP2K5_HUMAN | PRKMK5
Type:
PROTEIN
Mol. Mass.:
50110.16
Organism:
Homo sapiens (Human)
Description:
ChEMBL_1495740
Residue:
448
  
Inhibitor
Name:
BDBM482158
Synonyms:
BDBM50242742 | TAE684
Type:
Emp. Form.:
C30H40ClN7O3S
Mol. Mass.:
614.202
SMILES:
COc1cc(ccc1Nc1ncc(Cl)c(Nc2ccccc2S(=O)(=O)C(C)C)n1)N1CCC(CC1)N1CCN(C)CC1
: