Target
Membrane-associated tyrosine- and threonine-specific cdc2-inhibitory kinase
Ligand
BDBM50193995
Substrate
Meas. Tech.
ChEMBL_774237 (CHEMBL1908454)
Kd
>10000±n/a nM
Citation
 Davis, MIHunt, JPHerrgard, SCiceri, PWodicka, LMPallares, GHocker, MTreiber, DKZarrinkar, PP Comprehensive analysis of kinase inhibitor selectivity. Nat Biotechnol 29:1046-51 (2011)  
Target
Name:
Membrane-associated tyrosine- and threonine-specific cdc2-inhibitory kinase
Synonyms:
MYT1 PMYT1_HUMAN | Tyrosine- and threonine-specific cdc2-inhibitory kinase
Type:
PROTEIN
Mol. Mass.:
54523.76
Organism:
Homo sapiens (Human)
Description:
ChEMBL_587209
Residue:
499
  
Inhibitor
Name:
BDBM50193995
Synonyms:
3-((3R,4R)-4-methyl-3-(methyl(7H-pyrrolo[2,3-d]pyrimidin-4-yl)amino)piperidin-1-yl)-3-oxopropanenitrile 3-{(3R,4R)-4-methyl-3-[methyl(7H-pyrrolo[2,3-d]pyrimidin-4-yl)amino]piperidin-1-yl}-3-oxopropanenitrile CP-690550 Tofacitinib US10112907, Example 00035 US10766894, Compound TABLE 1.20 US11078206, Example Tofacitinib US11339167, Example Tofacitinib
Type:
Small organic molecule
Emp. Form.:
C16H20N6O
Mol. Mass.:
312.3696
SMILES:
C[C@@H]1CCN(C[C@@H]1N(C)c1ncnc2[nH]ccc12)C(=O)CC#N
: