Target
RAC-gamma serine/threonine-protein kinase
Ligand
BDBM31093
Substrate
Meas. Tech.
ChEMBL_774499 (CHEMBL1908716)
Kd
>10000±n/a nM
Citation
 Davis, MIHunt, JPHerrgard, SCiceri, PWodicka, LMPallares, GHocker, MTreiber, DKZarrinkar, PP Comprehensive analysis of kinase inhibitor selectivity. Nat Biotechnol 29:1046-51 (2011)  
Target
Name:
RAC-gamma serine/threonine-protein kinase
Synonyms:
AKT3 PKB gamma Protein kinase Akt-3 Protein kinase B, gamma RAC-gamma serine/threonine-protein kinase Serine/threonine-protein kinase AKT | Serine/threonine-protein kinase AKT3
Type:
Enzyme
Mol. Mass.:
55769.36
Organism:
Homo sapiens (Human)
Description:
Residue:
479
  
Inhibitor
Name:
BDBM31093
Synonyms:
4-[[7-[2,6-bis(fluoranyl)phenyl]-9-chloranyl-5H-pyrimido[5,4-d][2]benzazepin-2-yl]amino]benzoic acid BDBM31832 MLN-8054 | cid_11712649
Type:
Small organic molecule
Emp. Form.:
C25H15ClF2N4O2
Mol. Mass.:
476.862
SMILES:
OC(=O)c1ccc(Nc2ncc3CN=C(c4cc(Cl)ccc4-c3n2)c2c(F)cccc2F)cc1
: