Target
Cyclin-dependent kinase 2 homolog
Ligand
BDBM50355501
Substrate
Meas. Tech.
ChEMBL_774240 (CHEMBL1908457)
Kd
>10000±n/a nM
Citation
 Davis, MIHunt, JPHerrgard, SCiceri, PWodicka, LMPallares, GHocker, MTreiber, DKZarrinkar, PP Comprehensive analysis of kinase inhibitor selectivity. Nat Biotechnol 29:1046-51 (2011)  
Target
Name:
Cyclin-dependent kinase 2 homolog
Synonyms:
CDK2H_PLAF7 Cell division control protein 2 homolog | PK5
Type:
PROTEIN
Mol. Mass.:
33000.81
Organism:
Plasmodium falciparum (isolate 3D7)
Description:
ChEMBL_774240
Residue:
288
  
Inhibitor
Name:
BDBM50355501
Synonyms:
INCB-018424 RUXOLITINIB PHOSPHATE US10766894, Compound TABLE 1.1 US11203595, TABLE 1.1 | US11279703, TABLE 6.147
Type:
Small organic molecule
Emp. Form.:
C17H18N6
Mol. Mass.:
306.365
SMILES:
N#CC[C@H](C1CCCC1)n1cc(cn1)-c1ncnc2[nH]ccc12
: