Target
Calcium/calmodulin-dependent protein kinase type 1G
Ligand
BDBM50355499
Substrate
Meas. Tech.
ChEMBL_774599 (CHEMBL1908816)
Kd
6200±n/a nM
Citation
 Davis, MIHunt, JPHerrgard, SCiceri, PWodicka, LMPallares, GHocker, MTreiber, DKZarrinkar, PP Comprehensive analysis of kinase inhibitor selectivity. Nat Biotechnol 29:1046-51 (2011)  
Target
Name:
Calcium/calmodulin-dependent protein kinase type 1G
Synonyms:
CAMK1G CaM kinase I gamma VWS1
Type:
PROTEIN
Mol. Mass.:
53096.44
Organism:
Homo sapiens (Human)
Description:
ChEMBL_774599
Residue:
476
  
Inhibitor
Name:
BDBM50355499
Synonyms:
CHEMBL1908395 | CHEMBL1908842
Type:
Small organic molecule
Emp. Form.:
C26H32N6O2
Mol. Mass.:
460.5713
SMILES:
CN(C)CC(=O)N1CCC(CC1)c1ccc(NC(=O)c2ncc([nH]2)C#N)c(c1)C1=CCCCC1
: