Target
Mitogen-activated protein kinase kinase kinase 2
Ligand
BDBM50355496
Substrate
Meas. Tech.
ChEMBL_774542 (CHEMBL1908759)
Kd
72±n/a nM
Citation
 Davis, MIHunt, JPHerrgard, SCiceri, PWodicka, LMPallares, GHocker, MTreiber, DKZarrinkar, PP Comprehensive analysis of kinase inhibitor selectivity. Nat Biotechnol 29:1046-51 (2011)  
Target
Name:
Mitogen-activated protein kinase kinase kinase 2
Synonyms:
M3K2_HUMAN MAPK/ERK kinase kinase 2 MEK kinase 2 MEKK2
Type:
PROTEIN
Mol. Mass.:
69751.14
Organism:
Homo sapiens (Human)
Description:
ChEMBL_1473904
Residue:
619
  
Inhibitor
Name:
BDBM50355496
Synonyms:
CHEMBL1908397
Type:
Small organic molecule
Emp. Form.:
C20H20N4O
Mol. Mass.:
332.399
SMILES:
O=C(N1CCNCC1)c1ccc(\C=C\c2n[nH]c3ccccc23)cc1
: