Target
Mitogen-activated protein kinase kinase kinase 6
Ligand
BDBM482158
Substrate
Meas. Tech.
ChEMBL_774442 (CHEMBL1908659)
Kd
1800±n/a nM
Citation
 Davis, MIHunt, JPHerrgard, SCiceri, PWodicka, LMPallares, GHocker, MTreiber, DKZarrinkar, PP Comprehensive analysis of kinase inhibitor selectivity. Nat Biotechnol 29:1046-51 (2011)  
Target
Name:
Mitogen-activated protein kinase kinase kinase 6
Synonyms:
ASK2 M3K6_HUMAN MAPKKK6 | MEKK6
Type:
PROTEIN
Mol. Mass.:
142605.03
Organism:
Homo sapiens (Human)
Description:
ChEMBL_655684
Residue:
1288
  
Inhibitor
Name:
BDBM482158
Synonyms:
BDBM50242742 | TAE684
Type:
Emp. Form.:
C30H40ClN7O3S
Mol. Mass.:
614.202
SMILES:
COc1cc(ccc1Nc1ncc(Cl)c(Nc2ccccc2S(=O)(=O)C(C)C)n1)N1CCC(CC1)N1CCN(C)CC1
: