Target
Phosphatidylinositol 4-phosphate 3-kinase C2 domain-containing subunit beta
Ligand
BDBM60665
Substrate
Meas. Tech.
ChEMBL_774357 (CHEMBL1908574)
Kd
>10000±n/a nM
Citation
 Davis, MIHunt, JPHerrgard, SCiceri, PWodicka, LMPallares, GHocker, MTreiber, DKZarrinkar, PP Comprehensive analysis of kinase inhibitor selectivity. Nat Biotechnol 29:1046-51 (2011)  
Target
Name:
Phosphatidylinositol 4-phosphate 3-kinase C2 domain-containing subunit beta
Synonyms:
C2-PI3K PI3K-C2beta Phosphatidylinositol 4-phosphate 3-kinase C2 beta (PIK3C2B) Phosphoinositide 3-Kinase (PI3K), C2beta PtdIns-3-kinase C2 beta
Type:
Enzyme
Mol. Mass.:
184784.86
Organism:
Homo sapiens (Human)
Description:
O00750
Residue:
1634
  
Inhibitor
Name:
BDBM60665
Synonyms:
BDBM50249542 US9212178, R406
Type:
Emp. Form.:
C22H23FN6O5
Mol. Mass.:
470.4536
SMILES:
COc1cc(Nc2ncc(F)c(Nc3ccc4OC(C)(C)C(=O)Nc4n3)n2)cc(OC)c1OC
: