Target
Serine/threonine-protein kinase PAK 5
Ligand
BDBM5447
Substrate
Meas. Tech.
ChEMBL_774597 (CHEMBL1908814)
Kd
>10000±n/a nM
Citation
 Davis, MIHunt, JPHerrgard, SCiceri, PWodicka, LMPallares, GHocker, MTreiber, DKZarrinkar, PP Comprehensive analysis of kinase inhibitor selectivity. Nat Biotechnol 29:1046-51 (2011)  
Target
Name:
Serine/threonine-protein kinase PAK 5
Synonyms:
KIAA1264 PAK5_HUMAN PAK7/PAK5 Serine/threonine-protein kinase (PAK7) Serine/threonine-protein kinase PAK7
Type:
Protein
Mol. Mass.:
80760.58
Organism:
Homo sapiens (Human)
Description:
Q9P286
Residue:
719
  
Inhibitor
Name:
BDBM5447
Synonyms:
CHEMBL939 Iressa N-(3-chloro-4-fluorophenyl)-7-methoxy-6-[3-(morpholin-4-yl)propoxy]quinazolin-4-amine US10507209, Compound Gefitinib US9730934, Gefitinib WO2022090481, Example gefitinib cid_123631
Type:
Small organic molecule
Emp. Form.:
C22H24ClFN4O3
Mol. Mass.:
446.902
SMILES:
COc1cc2ncnc(Nc3ccc(F)c(Cl)c3)c2cc1OCCCN1CCOCC1
: