Target
Serine/threonine-protein kinase Nek4
Ligand
BDBM60665
Substrate
Meas. Tech.
ChEMBL_774384 (CHEMBL1908601)
Kd
1800±n/a nM
Citation
 Davis, MIHunt, JPHerrgard, SCiceri, PWodicka, LMPallares, GHocker, MTreiber, DKZarrinkar, PP Comprehensive analysis of kinase inhibitor selectivity. Nat Biotechnol 29:1046-51 (2011)  
Target
Name:
Serine/threonine-protein kinase Nek4
Synonyms:
NEK kinase NEK4_HUMAN | STK2
Type:
PROTEIN
Mol. Mass.:
94610.21
Organism:
Homo sapiens (Human)
Description:
ChEMBL_774384
Residue:
841
  
Inhibitor
Name:
BDBM60665
Synonyms:
BDBM50249542 US9212178, R406
Type:
Emp. Form.:
C22H23FN6O5
Mol. Mass.:
470.4536
SMILES:
COc1cc(Nc2ncc(F)c(Nc3ccc4OC(C)(C)C(=O)Nc4n3)n2)cc(OC)c1OC
: