Target
Serine/threonine-protein kinase N2
Ligand
BDBM50355497
Substrate
Meas. Tech.
ChEMBL_774530 (CHEMBL1908747)
Kd
>10000±n/a nM
Citation
 Davis, MIHunt, JPHerrgard, SCiceri, PWodicka, LMPallares, GHocker, MTreiber, DKZarrinkar, PP Comprehensive analysis of kinase inhibitor selectivity. Nat Biotechnol 29:1046-51 (2011)  
Target
Name:
Serine/threonine-protein kinase N2
Synonyms:
PKN2 PRK2 Protein kinase C-like 2 Protein-kinase C-related kinase 2 | Serine/threonine-protein kinase N2
Type:
PROTEIN
Mol. Mass.:
112029.78
Organism:
Homo sapiens (Human)
Description:
ChEMBL_1433151
Residue:
984
  
Inhibitor
Name:
BDBM50355497
Synonyms:
AZD-6244 | CHEMBL1614701
Type:
Small organic molecule
Emp. Form.:
C17H15BrClFN4O3
Mol. Mass.:
457.681
SMILES:
Cn1cnc2c(F)c(Nc3ccc(Br)cc3Cl)c(cc12)C(=O)NOCCO
: