Target
STE20/SPS1-related proline-alanine-rich protein kinase
Ligand
BDBM50355497
Substrate
Meas. Tech.
ChEMBL_774551 (CHEMBL1908768)
Kd
>10000±n/a nM
Citation
 Davis, MIHunt, JPHerrgard, SCiceri, PWodicka, LMPallares, GHocker, MTreiber, DKZarrinkar, PP Comprehensive analysis of kinase inhibitor selectivity. Nat Biotechnol 29:1046-51 (2011)  
Target
Name:
STE20/SPS1-related proline-alanine-rich protein kinase
Synonyms:
DCHT STK39 Serine/threonine-protein kinase 39 | Ste-20-related kinase
Type:
PROTEIN
Mol. Mass.:
59471.32
Organism:
Homo sapiens (Human)
Description:
ChEMBL_774551
Residue:
545
  
Inhibitor
Name:
BDBM50355497
Synonyms:
AZD-6244 | CHEMBL1614701
Type:
Small organic molecule
Emp. Form.:
C17H15BrClFN4O3
Mol. Mass.:
457.681
SMILES:
Cn1cnc2c(F)c(Nc3ccc(Br)cc3Cl)c(cc12)C(=O)NOCCO
: