Target
Serine/threonine-protein kinase ICK
Ligand
BDBM50355497
Substrate
Meas. Tech.
ChEMBL_774570 (CHEMBL1908787)
Kd
>10000±n/a nM
Citation
 Davis, MIHunt, JPHerrgard, SCiceri, PWodicka, LMPallares, GHocker, MTreiber, DKZarrinkar, PP Comprehensive analysis of kinase inhibitor selectivity. Nat Biotechnol 29:1046-51 (2011)  
Target
Name:
Serine/threonine-protein kinase ICK
Synonyms:
CILK1 ICK KIAA0936 Laryngeal cancer kinase 2 MRK | hICK
Type:
PROTEIN
Mol. Mass.:
71470.23
Organism:
Homo sapiens (Human)
Description:
ChEMBL_774570
Residue:
632
  
Inhibitor
Name:
BDBM50355497
Synonyms:
AZD-6244 | CHEMBL1614701
Type:
Small organic molecule
Emp. Form.:
C17H15BrClFN4O3
Mol. Mass.:
457.681
SMILES:
Cn1cnc2c(F)c(Nc3ccc(Br)cc3Cl)c(cc12)C(=O)NOCCO
: