Target
Serine/threonine-protein kinase SIK2
Ligand
BDBM50355497
Substrate
Meas. Tech.
ChEMBL_774575 (CHEMBL1908792)
Kd
>10000±n/a nM
Citation
 Davis, MIHunt, JPHerrgard, SCiceri, PWodicka, LMPallares, GHocker, MTreiber, DKZarrinkar, PP Comprehensive analysis of kinase inhibitor selectivity. Nat Biotechnol 29:1046-51 (2011)  
Target
Name:
Serine/threonine-protein kinase SIK2
Synonyms:
KIAA0781 SIK2 SNF1LK2 Serine/threonine-protein kinase SIK2
Type:
Protein
Mol. Mass.:
103906.53
Organism:
Homo sapiens (Human)
Description:
Residue:
926
  
Inhibitor
Name:
BDBM50355497
Synonyms:
AZD-6244 | CHEMBL1614701
Type:
Small organic molecule
Emp. Form.:
C17H15BrClFN4O3
Mol. Mass.:
457.681
SMILES:
Cn1cnc2c(F)c(Nc3ccc(Br)cc3Cl)c(cc12)C(=O)NOCCO
: