Target
Serine/threonine-protein kinase TAO2
Ligand
BDBM50355497
Substrate
Meas. Tech.
ChEMBL_774579 (CHEMBL1908796)
Kd
>10000±n/a nM
Citation
 Davis, MIHunt, JPHerrgard, SCiceri, PWodicka, LMPallares, GHocker, MTreiber, DKZarrinkar, PP Comprehensive analysis of kinase inhibitor selectivity. Nat Biotechnol 29:1046-51 (2011)  
Target
Name:
Serine/threonine-protein kinase TAO2
Synonyms:
KIAA0881 PSK TAOK2 | TAOK2_HUMAN
Type:
Enzyme
Mol. Mass.:
138262.36
Organism:
Homo sapiens (Human)
Description:
Q9UL54
Residue:
1235
  
Inhibitor
Name:
BDBM50355497
Synonyms:
AZD-6244 | CHEMBL1614701
Type:
Small organic molecule
Emp. Form.:
C17H15BrClFN4O3
Mol. Mass.:
457.681
SMILES:
Cn1cnc2c(F)c(Nc3ccc(Br)cc3Cl)c(cc12)C(=O)NOCCO
: