Target
Activin receptor type-2B
Ligand
BDBM25084
Substrate
Meas. Tech.
ChEMBL_774300 (CHEMBL1908517)
Kd
>10000±n/a nM
Citation
 Davis, MIHunt, JPHerrgard, SCiceri, PWodicka, LMPallares, GHocker, MTreiber, DKZarrinkar, PP Comprehensive analysis of kinase inhibitor selectivity. Nat Biotechnol 29:1046-51 (2011)  
Target
Name:
Activin receptor type-2B
Synonyms:
ACVR2B Activin receptor type-2B
Type:
Enzyme Catalytic Domain
Mol. Mass.:
57713.76
Organism:
Homo sapiens (Human)
Description:
gi_116734708
Residue:
512
  
Inhibitor
Name:
BDBM25084
Synonyms:
3-[2,4-diamino-6-(3-hydroxyphenyl)pteridin-7-yl]phenol TG100-115
Type:
Small organic molecule
Emp. Form.:
C18H14N6O2
Mol. Mass.:
346.3428
SMILES:
Nc1nc(N)c2nc(-c3cccc(O)c3)c(nc2n1)-c1cccc(O)c1
: