Target
Cyclin-dependent kinase 15
Ligand
BDBM50355494
Substrate
Meas. Tech.
ChEMBL_774198 (CHEMBL1908415)
Kd
>10000±n/a nM
Citation
 Davis, MIHunt, JPHerrgard, SCiceri, PWodicka, LMPallares, GHocker, MTreiber, DKZarrinkar, PP Comprehensive analysis of kinase inhibitor selectivity. Nat Biotechnol 29:1046-51 (2011)  
Target
Name:
Cyclin-dependent kinase 15
Synonyms:
ALS2CR7 CDK15 Cell division protein kinase 15 Serine/threonine-protein kinase ALS2CR7 | Serine/threonine-protein kinase PFTAIRE-2
Type:
PROTEIN
Mol. Mass.:
49029.02
Organism:
Homo sapiens (Human)
Description:
ChEMBL_655517
Residue:
435
  
Inhibitor
Name:
BDBM50355494
Synonyms:
CHEMBL1908396
Type:
Small organic molecule
Emp. Form.:
C24H24N4O5S
Mol. Mass.:
480.536
SMILES:
COc1cc(Oc2ccnc3cc(OC)c(OC)cc23)ccc1NC(=O)NC(C)c1nccs1
: