Target
Serine/threonine-protein kinase STK11
Ligand
BDBM5655
Substrate
Meas. Tech.
ChEMBL_774278 (CHEMBL1908495)
Kd
>10000±n/a nM
Citation
 Davis, MIHunt, JPHerrgard, SCiceri, PWodicka, LMPallares, GHocker, MTreiber, DKZarrinkar, PP Comprehensive analysis of kinase inhibitor selectivity. Nat Biotechnol 29:1046-51 (2011)  
Target
Name:
Serine/threonine-protein kinase STK11
Synonyms:
LKB1 STK11 Serine/threonine-protein kinase 11
Type:
PROTEIN
Mol. Mass.:
48640.33
Organism:
Homo sapiens (Human)
Description:
ChEMBL_655439
Residue:
433
  
Inhibitor
Name:
BDBM5655
Synonyms:
2-(2-chlorophenyl)-5,7-dihydroxy-8-[(3S,4R)-3-hydroxy-1-methylpiperidin-4-yl]-4H-chromen-4-one Flavopiridol US9617225, Flavopiridol
Type:
Small organic molecule
Emp. Form.:
C21H20ClNO5
Mol. Mass.:
401.84
SMILES:
CN1CC[C@@H]([C@H](O)C1)c1c(O)cc(O)c2c1oc(cc2=O)-c1ccccc1Cl
: