Target
Serine/threonine-protein kinase MAK
Ligand
BDBM25117
Substrate
Meas. Tech.
ChEMBL_774505 (CHEMBL1908722)
Kd
>10000±n/a nM
Citation
 Davis, MIHunt, JPHerrgard, SCiceri, PWodicka, LMPallares, GHocker, MTreiber, DKZarrinkar, PP Comprehensive analysis of kinase inhibitor selectivity. Nat Biotechnol 29:1046-51 (2011)  
Target
Name:
Serine/threonine-protein kinase MAK
Synonyms:
MAK Male germ cell-associated kinase
Type:
PROTEIN
Mol. Mass.:
70616.26
Organism:
Homo sapiens (Human)
Description:
ChEMBL_774505
Residue:
623
  
Inhibitor
Name:
BDBM25117
Synonyms:
AG-013736 N-methyl-2-({3-[(E)-2-(pyridin-2-yl)ethenyl]-1H-indazol-6-yl}sulfanyl)benzamide US9205078, Axitinib | US9617222, Compound A
Type:
Small organic molecule
Emp. Form.:
C22H18N4OS
Mol. Mass.:
386.47
SMILES:
CNC(=O)c1ccccc1Sc1ccc2c(\C=C\c3ccccn3)n[nH]c2c1
: