Target
Serine/threonine-protein kinase MARK1
Ligand
BDBM5446
Substrate
Meas. Tech.
ChEMBL_774593 (CHEMBL1908810)
Kd
>10000±n/a nM
Citation
 Davis, MIHunt, JPHerrgard, SCiceri, PWodicka, LMPallares, GHocker, MTreiber, DKZarrinkar, PP Comprehensive analysis of kinase inhibitor selectivity. Nat Biotechnol 29:1046-51 (2011)  
Target
Name:
Serine/threonine-protein kinase MARK1
Synonyms:
KIAA1477 MARK1 | MARK1_HUMAN
Type:
Enzyme
Mol. Mass.:
89034.85
Organism:
Homo sapiens (Human)
Description:
Q9P0L2
Residue:
795
  
Inhibitor
Name:
BDBM5446
Synonyms:
CHEMBL553 Erlotinib N-(3-Ethynylphenyl)-6,7-bis(2-methoxyethoxy)-4-quinazolinamine Monohydrochloride OSI-774 US10189853, erlotinib US11524945, Compound Erlotinib US9730934, Erlotinib cid_176870
Type:
Small organic molecule
Emp. Form.:
C22H23N3O4
Mol. Mass.:
393.4357
SMILES:
COCCOc1cc2ncnc(Nc3cccc(c3)C#C)c2cc1OCCOC
: