Target
Casein kinase I isoform gamma-3
Ligand
BDBM5655
Substrate
Meas. Tech.
ChEMBL_774429 (CHEMBL1908646)
Kd
>10000±n/a nM
Citation
 Davis, MIHunt, JPHerrgard, SCiceri, PWodicka, LMPallares, GHocker, MTreiber, DKZarrinkar, PP Comprehensive analysis of kinase inhibitor selectivity. Nat Biotechnol 29:1046-51 (2011)  
Target
Name:
Casein kinase I isoform gamma-3
Synonyms:
CSNK1G3 | KC1G3_HUMAN
Type:
PROTEIN
Mol. Mass.:
51411.12
Organism:
Homo sapiens (Human)
Description:
ChEMBL_1440403
Residue:
447
  
Inhibitor
Name:
BDBM5655
Synonyms:
2-(2-chlorophenyl)-5,7-dihydroxy-8-[(3S,4R)-3-hydroxy-1-methylpiperidin-4-yl]-4H-chromen-4-one Flavopiridol US9617225, Flavopiridol
Type:
Small organic molecule
Emp. Form.:
C21H20ClNO5
Mol. Mass.:
401.84
SMILES:
CN1CC[C@@H]([C@H](O)C1)c1c(O)cc(O)c2c1oc(cc2=O)-c1ccccc1Cl
: