Target
Casein kinase I isoform gamma-3
Ligand
BDBM50355501
Substrate
Meas. Tech.
ChEMBL_774429 (CHEMBL1908646)
Kd
>10000±n/a nM
Citation
 Davis, MIHunt, JPHerrgard, SCiceri, PWodicka, LMPallares, GHocker, MTreiber, DKZarrinkar, PP Comprehensive analysis of kinase inhibitor selectivity. Nat Biotechnol 29:1046-51 (2011)  
Target
Name:
Casein kinase I isoform gamma-3
Synonyms:
CSNK1G3 | KC1G3_HUMAN
Type:
PROTEIN
Mol. Mass.:
51411.12
Organism:
Homo sapiens (Human)
Description:
ChEMBL_1440403
Residue:
447
  
Inhibitor
Name:
BDBM50355501
Synonyms:
INCB-018424 RUXOLITINIB PHOSPHATE US10766894, Compound TABLE 1.1 US11203595, TABLE 1.1 | US11279703, TABLE 6.147
Type:
Small organic molecule
Emp. Form.:
C17H18N6
Mol. Mass.:
306.365
SMILES:
N#CC[C@H](C1CCCC1)n1cc(cn1)-c1ncnc2[nH]ccc12
: