Target
Serine/threonine-protein kinase 16
Ligand
BDBM60665
Substrate
Meas. Tech.
ChEMBL_774255 (CHEMBL1908472)
Kd
1.7±n/a nM
Citation
 Davis, MIHunt, JPHerrgard, SCiceri, PWodicka, LMPallares, GHocker, MTreiber, DKZarrinkar, PP Comprehensive analysis of kinase inhibitor selectivity. Nat Biotechnol 29:1046-51 (2011)  
Target
Name:
Serine/threonine-protein kinase 16
Synonyms:
MPSK1 STK16 Serine/threonine-protein kinase 16 Tyrosine-protein kinase STK16 (STK16)
Type:
Protein
Mol. Mass.:
34659.07
Organism:
Homo sapiens (Human)
Description:
Residue:
305
  
Inhibitor
Name:
BDBM60665
Synonyms:
BDBM50249542 US9212178, R406
Type:
Emp. Form.:
C22H23FN6O5
Mol. Mass.:
470.4536
SMILES:
COc1cc(Nc2ncc(F)c(Nc3ccc4OC(C)(C)C(=O)Nc4n3)n2)cc(OC)c1OC
: