Target
Calcium/calmodulin-dependent protein kinase type II subunit delta
Ligand
BDBM25117
Substrate
Meas. Tech.
ChEMBL_774250 (CHEMBL1908467)
Kd
>10000±n/a nM
Citation
 Davis, MIHunt, JPHerrgard, SCiceri, PWodicka, LMPallares, GHocker, MTreiber, DKZarrinkar, PP Comprehensive analysis of kinase inhibitor selectivity. Nat Biotechnol 29:1046-51 (2011)  
Target
Name:
Calcium/calmodulin-dependent protein kinase type II subunit delta
Synonyms:
CAMK2D CaM kinase II CaMK-II subunit delta Calcium/calmodulin-dependent protein kinase type II subunit delta (CAMK2D) KCC2D_HUMAN
Type:
Enzyme Catalytic Domain
Mol. Mass.:
56419.78
Organism:
Homo sapiens (Human)
Description:
Q13557
Residue:
499
  
Inhibitor
Name:
BDBM25117
Synonyms:
AG-013736 N-methyl-2-({3-[(E)-2-(pyridin-2-yl)ethenyl]-1H-indazol-6-yl}sulfanyl)benzamide US9205078, Axitinib | US9617222, Compound A
Type:
Small organic molecule
Emp. Form.:
C22H18N4OS
Mol. Mass.:
386.47
SMILES:
CNC(=O)c1ccccc1Sc1ccc2c(\C=C\c3ccccn3)n[nH]c2c1
: