Target
Myosin light chain kinase 3
Ligand
BDBM50355497
Substrate
Meas. Tech.
ChEMBL_774218 (CHEMBL1908435)
Kd
>10000±n/a nM
Citation
 Davis, MIHunt, JPHerrgard, SCiceri, PWodicka, LMPallares, GHocker, MTreiber, DKZarrinkar, PP Comprehensive analysis of kinase inhibitor selectivity. Nat Biotechnol 29:1046-51 (2011)  
Target
Name:
Myosin light chain kinase 3
Synonyms:
MLCK MYLK3_HUMAN | Myosin light chain kinase
Type:
PROTEIN
Mol. Mass.:
88384.80
Organism:
Homo sapiens (Human)
Description:
ChEMBL_774218
Residue:
819
  
Inhibitor
Name:
BDBM50355497
Synonyms:
AZD-6244 | CHEMBL1614701
Type:
Small organic molecule
Emp. Form.:
C17H15BrClFN4O3
Mol. Mass.:
457.681
SMILES:
Cn1cnc2c(F)c(Nc3ccc(Br)cc3Cl)c(cc12)C(=O)NOCCO
: