Target
Ephrin type-A receptor 6
Ligand
BDBM4552
Substrate
Meas. Tech.
ChEMBL_774433 (CHEMBL1908650)
Kd
>10000±n/a nM
Citation
 Davis, MIHunt, JPHerrgard, SCiceri, PWodicka, LMPallares, GHocker, MTreiber, DKZarrinkar, PP Comprehensive analysis of kinase inhibitor selectivity. Nat Biotechnol 29:1046-51 (2011)  
Target
Name:
Ephrin type-A receptor 6
Synonyms:
EHK-2 EHK2 EPH homology kinase 2 EPHA6 Ephrin receptor HEK12
Type:
PROTEIN
Mol. Mass.:
116385.76
Organism:
Homo sapiens (Human)
Description:
ChEMBL_774228
Residue:
1036
  
Inhibitor
Name:
BDBM4552
Synonyms:
4-[(2,4-Dichloro-5-methoxyphenyl)amino]-6-methoxy-7-[3-(4-methyl-1-piperazinyl)propoxy]-3-quinolinecarbonitrile BOSUTINIB SKI-606
Type:
Small organic molecule
Emp. Form.:
C26H29Cl2N5O3
Mol. Mass.:
530.446
SMILES:
COc1cc(Nc2c(cnc3cc(OCCCN4CCN(C)CC4)c(OC)cc23)C#N)c(Cl)cc1Cl
: