Target
TGF-beta receptor type-2
Ligand
BDBM50355500
Substrate
Meas. Tech.
ChEMBL_774389 (CHEMBL1908606)
Kd
>10000±n/a nM
Citation
 Davis, MIHunt, JPHerrgard, SCiceri, PWodicka, LMPallares, GHocker, MTreiber, DKZarrinkar, PP Comprehensive analysis of kinase inhibitor selectivity. Nat Biotechnol 29:1046-51 (2011)  
Target
Name:
TGF-beta receptor type-2
Synonyms:
TGF-beta receptor type II TGFR2_HUMAN
Type:
PROTEIN
Mol. Mass.:
64559.49
Organism:
Homo sapiens (Human)
Description:
ChEMBL_586859
Residue:
567
  
Inhibitor
Name:
BDBM50355500
Synonyms:
CHEMBL1908394 | US9695172, GSK461364
Type:
Small organic molecule
Emp. Form.:
C27H28F3N5O2S
Mol. Mass.:
543.604
SMILES:
C[C@@H](Oc1cc(sc1C(N)=O)-n1cnc2ccc(CN3CCN(C)CC3)cc12)c1ccccc1C(F)(F)F
: