Target
Phosphatidylinositol 4-kinase beta
Ligand
BDBM50237710
Substrate
Meas. Tech.
ChEMBL_774360 (CHEMBL1908577)
Kd
>10000±n/a nM
Citation
 Davis, MIHunt, JPHerrgard, SCiceri, PWodicka, LMPallares, GHocker, MTreiber, DKZarrinkar, PP Comprehensive analysis of kinase inhibitor selectivity. Nat Biotechnol 29:1046-51 (2011)  
Target
Name:
Phosphatidylinositol 4-kinase beta
Synonyms:
NPIK PI4K-beta PI4KB PI4Kbeta PIK4CB Phosphatidylinositol 4-kinase, PI4K | PtdIns 4-kinase beta
Type:
Protein
Mol. Mass.:
91373.30
Organism:
Homo sapiens (Human)
Description:
Residue:
816
  
Inhibitor
Name:
BDBM50237710
Synonyms:
4-methyl-N-[3-(4-methyl-1H-imidazol-1-yl)-5-(trifluoromethyl)phenyl]-3-[(4-pyridin-3-ylpyrimidin-2-yl)amino]benzamide AMN107 NILOTINIB | US11649218, Example Nilotinib
Type:
Small organic molecule
Emp. Form.:
C28H22F3N7O
Mol. Mass.:
529.5158
SMILES:
Cc1cn(cn1)-c1cc(NC(=O)c2ccc(C)c(Nc3nccc(n3)-c3cccnc3)c2)cc(c1)C(F)(F)F
: