Target
Serine/threonine-protein kinase Chk2
Ligand
BDBM50355556
Substrate
Meas. Tech.
ChEMBL_776643 (CHEMBL1913740)
IC50
>100000±n/a nM
Citation
 Andreani, AGranaiola, MLeoni, ALocatelli, AMorigi, RRambaldi, MVaroli, LLannigan, DSmith, JScudiero, DKondapaka, SShoemaker, RH Imidazo[2,1-b]thiazole guanylhydrazones as RSK2 inhibitors. Eur J Med Chem 46:4311-23 (2011)  
Target
Name:
Serine/threonine-protein kinase Chk2
Synonyms:
CDS1 CHK2 Checkpoint Kinase (Chk2) Serine/threonine-protein kinase Chek2 | Serine/threonine-protein kinase Chk1/2
Type:
Protein
Mol. Mass.:
60908.59
Organism:
Homo sapiens (Human)
Description:
O96017
Residue:
543
  
Inhibitor
Name:
BDBM50355556
Synonyms:
CHEMBL1910623
Type:
Small organic molecule
Emp. Form.:
C17H17N7O4
Mol. Mass.:
383.3614
SMILES:
COc1cc(c(OC)cc1-c1nc2ccccn2c1C=N[NH+]=C(N)[NH-])[N+]([O-])=O
: