Target
Ribosomal protein S6 kinase alpha-3
Ligand
BDBM50355587
Substrate
Meas. Tech.
ChEMBL_776690 (CHEMBL1913787)
IC50
>100000±n/a nM
Citation
 Andreani, AGranaiola, MLeoni, ALocatelli, AMorigi, RRambaldi, MVaroli, LLannigan, DSmith, JScudiero, DKondapaka, SShoemaker, RH Imidazo[2,1-b]thiazole guanylhydrazones as RSK2 inhibitors. Eur J Med Chem 46:4311-23 (2011)  
Target
Name:
Ribosomal protein S6 kinase alpha-3
Synonyms:
90 kDa ribosomal protein S6 kinase 3 ISPK1 MAP kinase-activated protein kinase 1b RPS6KA3 RSK2 Ribosomal protein S6 kinase Ribosomal protein S6 kinase alpha-3 (RSK2) S6K-alpha 3 p90 ribosomal s6 kinase (RSK2) p90RSK | pp90RSK2
Type:
Serine/threonine-protein kinase
Mol. Mass.:
83740.03
Organism:
Homo sapiens (Human)
Description:
The human RSK2 sequence differed from the Genbank entry NM_004586 at one residue, V45G. The protein was cloned and purified from baculovirus expression system.
Residue:
740
  
Inhibitor
Name:
BDBM50355587
Synonyms:
CHEMBL1910595
Type:
Small organic molecule
Emp. Form.:
C15H16N8O4S
Mol. Mass.:
404.404
SMILES:
COc1cc(c(OC)cc1-c1nc2sc(C)nn2c1\C=N/NC(N)=N)[N+]([O-])=O
: