Target
Serine/threonine-protein kinase Chk2
Ligand
BDBM50355585
Substrate
Meas. Tech.
ChEMBL_776643 (CHEMBL1913740)
IC50
90000±n/a nM
Citation
 Andreani, AGranaiola, MLeoni, ALocatelli, AMorigi, RRambaldi, MVaroli, LLannigan, DSmith, JScudiero, DKondapaka, SShoemaker, RH Imidazo[2,1-b]thiazole guanylhydrazones as RSK2 inhibitors. Eur J Med Chem 46:4311-23 (2011)  
Target
Name:
Serine/threonine-protein kinase Chk2
Synonyms:
CDS1 CHK2 Checkpoint Kinase (Chk2) Serine/threonine-protein kinase Chek2 | Serine/threonine-protein kinase Chk1/2
Type:
Protein
Mol. Mass.:
60908.59
Organism:
Homo sapiens (Human)
Description:
O96017
Residue:
543
  
Inhibitor
Name:
BDBM50355585
Synonyms:
CHEMBL1910373
Type:
Small organic molecule
Emp. Form.:
C13H10ClFN6S
Mol. Mass.:
336.775
SMILES:
NC(=N)N\N=C\c1c(nc2sc(Cl)cn12)-c1ccc(F)cc1
: