Target
Mineralocorticoid receptor
Ligand
BDBM50348401
Substrate
Meas. Tech.
ChEMBL_776309 (CHEMBL1914160)
EC50
>5000±n/a nM
Citation
 Weinstein, DSGong, HDoweyko, AMCunningham, MHabte, SWang, JHHolloway, DABurke, CGao, LGuarino, VCarman, JSomerville, JEShuster, DSalter-Cid, LDodd, JHNadler, SGBarrish, JC Azaxanthene based selective glucocorticoid receptor modulators: design, synthesis, and pharmacological evaluation of (S)-4-(5-(1-((1,3,4-thiadiazol-2-yl)amino)-2-methyl-1-oxopropan-2-yl)-5H-chromeno[2,3-b]pyridin-2-yl)-2-fluoro-N,N-dimethylbenzamide (BMS-776532) and its methylene homologue (BMS-791 J Med Chem 54:7318-33 (2011)  
Target
Name:
Mineralocorticoid receptor
Synonyms:
MCR MLR NR3C2 | Nuclear receptor subfamily 3 group C member 2
Type:
Enzyme
Mol. Mass.:
107076.42
Organism:
Homo sapiens (Human)
Description:
P08235
Residue:
984
  
Inhibitor
Name:
BDBM50348401
Synonyms:
CHEMBL1801012
Type:
Small organic molecule
Emp. Form.:
C20H20N2O2S
Mol. Mass.:
352.45
SMILES:
CC(C)([C@@H](c1ccccc1)c1ccc(O)cc1)C(=O)Nc1nccs1
: