Target
DNA-directed RNA polymerase subunit beta
Ligand
BDBM50355755
Substrate
Meas. Tech.
ChEMBL_776375 (CHEMBL1914226)
IC50
15±n/a nM
Citation
 Jin, YGill, SKKirchhoff, PDWan, BFranzblau, SGGarcia, GAShowalter, HD Synthesis and structure-activity relationships of novel substituted 8-amino, 8-thio, and 1,8-pyrazole congeners of antitubercular rifamycin S and rifampin. Bioorg Med Chem Lett 21:6094-9 (2011)  
Target
Name:
DNA-directed RNA polymerase subunit beta
Synonyms:
DNA-directed RNA polymerase beta chain RNA polymerase subunit beta RPOB_MYCTU rpoB
Type:
PROTEIN
Mol. Mass.:
129817.10
Organism:
Mycobacterium tuberculosis
Description:
ChEMBL_776375
Residue:
1178
  
Inhibitor
Name:
BDBM50355755
Synonyms:
CHEMBL1911296
Type:
Small organic molecule
Emp. Form.:
C38H47NO11S
Mol. Mass.:
725.845
SMILES:
CO[C@H]1\C=C\O[C@@]2(C)Oc3c(C2=O)c2C(=O)C=C(NC(=O)\C(C)=C/C=C/[C@H](C)[C@H](O)[C@@H](C)[C@@H](O)[C@@H](C)[C@H](OC(C)=O)[C@@H]1C)C(=O)c2c(SC)c3C
: