Target
Cannabinoid receptor 1
Ligand
BDBM50355892
Substrate
Meas. Tech.
ChEMBL_775757 (CHEMBL1912191)
Ki
0.20±n/a nM
Citation
 Gao, LLi, MMeng, TPeng, HXie, XZhang, YJin, YWang, XZou, LShen, J Asymmetric synthesis and biological evaluation of N-cyclohexyl-4-[1-(2,4-dichlorophenyl)-1-(p-tolyl)methyl]piperazine-1-carboxamide as hCB1 receptor antagonists. Eur J Med Chem 46:5310-6 (2011)  
Target
Name:
Cannabinoid receptor 1
Synonyms:
CANN6 CB-R CNR CNR1_HUMAN Cannabinoid receptor Cannabinoid receptor 1 (brain)
Type:
G Protein-Coupled Receptor (GPCR)
Mol. Mass.:
52868.96
Organism:
Homo sapiens (Human)
Description:
P21554
Residue:
472
  
Inhibitor
Name:
BDBM50355892
Synonyms:
CHEMBL1910035
Type:
Small organic molecule
Emp. Form.:
C25H31Cl2N3O
Mol. Mass.:
460.439
SMILES:
Cc1ccc(cc1)[C@H](N1CCN(CC1)C(=O)NC1CCCCC1)c1ccc(Cl)cc1Cl
: